Target
Vascular endothelial growth factor receptor 2
Ligand
BDBM50338503
Substrate
Meas. Tech.
ChEMBL_728317 (CHEMBL1687577)
IC50
309±n/a nM
Citation
 Honda, TNagahara, HMogi, HBan, MAono, H KDR inhibitor with the intramolecular non-bonded interaction: conformation-activity relationships of novel indole-3-carboxamide derivatives. Bioorg Med Chem Lett 21:1782-5 (2011)  
Target
Name:
Vascular endothelial growth factor receptor 2
Synonyms:
CD_antigen=CD309 Fetal liver kinase 1 (FLK-1) KDR Protein-tyrosine kinase receptor Flk-1 VEGFR-2 VEGFR2 Vascular Endothelial Growth Factor Receptor Kinase 2 Vascular endothelial growth factor receptor 2 (KDR) Vascular endothelial growth factor receptor 2 (VEGFR2) Vascular endothelial growth factor receptor-2 (VEGFR-2)
Type:
Receptor Tyrosine Kinase
Mol. Mass.:
151510.97
Organism:
Homo sapiens (Human)
Description:
P35968
Residue:
1356
  
Inhibitor
Name:
BDBM50338503
Synonyms:
4-(pyridin-4-ylmethylthio)-N-(3-(trifluoromethyl)phenyl)-1H-indole-3-carboxamide | CHEMBL1683339
Type:
Small organic molecule
Emp. Form.:
C22H16F3N3OS
Mol. Mass.:
427.442
SMILES:
FC(F)(F)c1cccc(NC(=O)c2c[nH]c3cccc(SCc4ccncc4)c23)c1
: