Target
Beta-lactamase
Ligand
BDBM50021954
Substrate
Meas. Tech.
ChEMBL_733518 (CHEMBL1689856)
IC50
27000±n/a nM
Citation
 Stachyra, TPéchereau, MCBruneau, JMClaudon, MFrère, JMMiossec, CColeman, KBlack, MT Mechanistic studies of the inactivation of TEM-1 and P99 by NXL104, a novel non-beta-lactam beta-lactamase inhibitor. Antimicrob Agents Chemother 54:5132-8 (2010)  
Target
Name:
Beta-lactamase
Synonyms:
AMPC_PSEAE beta-Lactamase
Type:
Enzyme
Mol. Mass.:
43406.87
Organism:
Pseudomonas aeruginosa (PAO1)
Description:
P24735
Residue:
397
  
Inhibitor
Name:
BDBM50021954
Synonyms:
(2S,5R)-3,3-Dimethyl-4,4,7-trioxo-4lambda*6*-thia-1-aza-bicyclo[3.2.0]heptane-2-carboxylic acid 3,3-Dimethyl-4,4,7-trioxo-4lambda*6*-thia-1-aza-bicyclo[3.2.0]heptane-2-carboxylic acid CHEMBL403 SULBACTAM US20230322715, Compound ALK-09 | US9120808, Sulbactam sodium salt
Type:
Small organic molecule
Emp. Form.:
C8H11NO5S
Mol. Mass.:
233.242
SMILES:
CC1(C)[C@@H](N2[C@@H](CC2=O)S1(=O)=O)C(O)=O
: