Target
Beta-lactamase
Ligand
BDBM50053173
Substrate
Meas. Tech.
ChEMBL_733518 (CHEMBL1689856)
IC50
4600±n/a nM
Citation
 Stachyra, TPéchereau, MCBruneau, JMClaudon, MFrère, JMMiossec, CColeman, KBlack, MT Mechanistic studies of the inactivation of TEM-1 and P99 by NXL104, a novel non-beta-lactam beta-lactamase inhibitor. Antimicrob Agents Chemother 54:5132-8 (2010)  
Target
Name:
Beta-lactamase
Synonyms:
AMPC_PSEAE beta-Lactamase
Type:
Enzyme
Mol. Mass.:
43406.87
Organism:
Pseudomonas aeruginosa (PAO1)
Description:
P24735
Residue:
397
  
Inhibitor
Name:
BDBM50053173
Synonyms:
(2S,3S,5R)-3-Methyl-4,4,7-trioxo-3-[1,2,3]triazol-1-ylmethyl-4-thia-1-aza-bicyclo[3.2.0]heptane-2-carboxylic acid (2S,3S,5R)-3-methyl-4,4,7-trioxo-3-[1,2,3]triazol-1-ylmethyl-4lambda6-thia-1-aza-bicyclo[3.2.0]heptane-2-carboxylic acid 3-Methyl-4,4,7-trioxo-3-[1,2,3]triazol-1-ylmethyl-4lambda*6*-thia-1-aza-bicyclo[3.2.0]heptane-2-carboxylic acid CL-298741 US9120808, Tazobactam sodium salt YTR-830H | Zosyn
Type:
Small organic molecule
Emp. Form.:
C10H12N4O5S
Mol. Mass.:
300.291
SMILES:
C[C@]1(Cn2ccnn2)[C@@H](N2[C@@H](CC2=O)S1(=O)=O)C(O)=O
: