Target
Carbonic anhydrase 2
Ligand
BDBM50339599
Substrate
Meas. Tech.
ChEMBL_736727 (CHEMBL1695108)
Ki
10800±n/a nM
Citation
 Davis, RAHofmann, AOsman, AHall, RAMühlschlegel, FAVullo, DInnocenti, ASupuran, CTPoulsen, SA Natural product-based phenols as novel probes for mycobacterial and fungal carbonic anhydrases. J Med Chem 54:1682-92 (2011)  
Target
Name:
Carbonic anhydrase 2
Synonyms:
CA-II CAC Carbonate dehydratase II Carbonic anhydrase 2 (CA-II) Carbonic anhydrase C Carbonic anhydrase II (CA-II) Carbonic anhydrase II (hCA II) | Carbonic anhydrase isoenzyme II (hCA II)
Type:
Enzyme
Mol. Mass.:
29250.71
Organism:
Homo sapiens (Human)
Description:
P00918
Residue:
260
  
Inhibitor
Name:
BDBM50339599
Synonyms:
2-(3-chloro-4-hydroxyphenyl)-N-(3-methoxyphenethyl)acetamide | CHEMBL589606
Type:
Small organic molecule
Emp. Form.:
C17H18ClNO3
Mol. Mass.:
319.783
SMILES:
COc1cccc(CCNC(=O)Cc2ccc(O)c(Cl)c2)c1
: