Target
Carbonic anhydrase
Ligand
BDBM50339588
Substrate
Meas. Tech.
ChEMBL_736722 (CHEMBL1695103)
Ki
10800±n/a nM
Citation
 Davis, RAHofmann, AOsman, AHall, RAMühlschlegel, FAVullo, DInnocenti, ASupuran, CTPoulsen, SA Natural product-based phenols as novel probes for mycobacterial and fungal carbonic anhydrases. J Med Chem 54:1682-92 (2011)  
Target
Name:
Carbonic anhydrase
Synonyms:
PROBABLE TRANSMEMBRANE CARBONIC ANHYDRASE (CARBONATE DEHYDRATASE) (CARBONIC DEHYDRATASE)
Type:
PROTEIN
Mol. Mass.:
80567.22
Organism:
Mycobacterium tuberculosis
Description:
ChEMBL_878775
Residue:
764
  
Inhibitor
Name:
BDBM50339588
Synonyms:
(3-CHLORO-4-HYDROXYPHENYL)ACETIC ACID 3-chloro-4-hydroxyphenylacetic acid | CHEMBL592010
Type:
Small organic molecule
Emp. Form.:
C8H7ClO3
Mol. Mass.:
186.592
SMILES:
OC(=O)Cc1ccc(O)c(Cl)c1
: