Target
Carbonic anhydrase
Ligand
BDBM50339599
Substrate
Meas. Tech.
ChEMBL_736725 (CHEMBL1695106)
Ki
940±n/a nM
Citation
 Davis, RAHofmann, AOsman, AHall, RAMühlschlegel, FAVullo, DInnocenti, ASupuran, CTPoulsen, SA Natural product-based phenols as novel probes for mycobacterial and fungal carbonic anhydrases. J Med Chem 54:1682-92 (2011)  
Target
Name:
Carbonic anhydrase
Synonyms:
Carbonic Anhydrase 2 (Can2)
Type:
Enzyme
Mol. Mass.:
26594.37
Organism:
Cryptococcus neoformans var. grubii (Filobasidiella neoformans var. grubii)
Description:
Residue:
239
  
Inhibitor
Name:
BDBM50339599
Synonyms:
2-(3-chloro-4-hydroxyphenyl)-N-(3-methoxyphenethyl)acetamide | CHEMBL589606
Type:
Small organic molecule
Emp. Form.:
C17H18ClNO3
Mol. Mass.:
319.783
SMILES:
COc1cccc(CCNC(=O)Cc2ccc(O)c(Cl)c2)c1
: