Target
Extracellular calcium-sensing receptor
Ligand
BDBM50339746
Substrate
Meas. Tech.
ChEMBL_735492 (CHEMBL1692876)
IC50
81±n/a nM
Citation
 Yoshida, MMori, AMorimoto, SKotani, EOka, MNotoya, KMakino, HOno, MShirasaki, MTada, NFujita, HBan, JIkeda, YKawamoto, TGoto, MKimura, HBaba, AYasuma, T Novel and potent calcium-sensing receptor antagonists: discovery of (5R)-N-[1-ethyl-1-(4-ethylphenyl)propyl]-2,7,7-trimethyl-5-phenyl-4,5,6,7-tetrahydropyrazolo[1,5-a]pyrimidine-3-carboxamide monotosylate (TAK-075) as an orally active bone anabolic agent. Bioorg Med Chem 19:1881-94 (2011)  
Target
Name:
Extracellular calcium-sensing receptor
Synonyms:
CASR CaR Calcium-sensing receptor (CaSR) GPRC2A Parathyroid Cell calcium-sensing receptor Synonyms=GPRC2A | hCasR
Type:
Protein
Mol. Mass.:
120663.13
Organism:
Homo sapiens (Human)
Description:
P41180
Residue:
1078
  
Inhibitor
Name:
BDBM50339746
Synonyms:
CHEMBL1689044 | rac-N-[1-Ethyl-1-(4-methylphenyl)propyl]-7,7-dimethyl-2,5-diphenyl-4,5,6,7-tetrahydopyrazolo[1,5-a]pyrimidine-3-carboxamide
Type:
Small organic molecule
Emp. Form.:
C33H38N4O
Mol. Mass.:
506.681
SMILES:
CCC(CC)(NC(=O)c1c2NC(CC(C)(C)n2nc1-c1ccccc1)c1ccccc1)c1ccc(C)cc1
: