Target
Carbonic anhydrase 1
Ligand
BDBM50146756
Substrate
Meas. Tech.
ChEMBL_735539 (CHEMBL1693044)
Ki
2395±n/a nM
Citation
 Pacchiano, FCarta, FMcDonald, PCLou, YVullo, DScozzafava, ADedhar, SSupuran, CT Ureido-substituted benzenesulfonamides potently inhibit carbonic anhydrase IX and show antimetastatic activity in a model of breast cancer metastasis. J Med Chem 54:1896-902 (2011)  
Target
Name:
Carbonic anhydrase 1
Synonyms:
CA-I CAB Carbonate dehydratase I Carbonic anhydrase 1 (CA I) Carbonic anhydrase 1 (Recombinant CA I) Carbonic anhydrase B Carbonic anhydrase I (CA I) Carbonic anhydrase I (CAI) Carbonic anhydrase isoenzyme I (hCA I) | hCA
Type:
Enzyme
Mol. Mass.:
28873.37
Organism:
Homo sapiens (Human)
Description:
P00915
Residue:
261
  
Inhibitor
Name:
BDBM50146756
Synonyms:
4-(3-Pentafluorophenyl-ureido)-benzenesulfonamide | CHEMBL316779
Type:
Small organic molecule
Emp. Form.:
C13H8F5N3O3S
Mol. Mass.:
381.278
SMILES:
NS(=O)(=O)c1ccc(NC(=O)Nc2c(F)c(F)c(F)c(F)c2F)cc1
: