Target
Carbonic anhydrase 12
Ligand
BDBM50146756
Substrate
Meas. Tech.
ChEMBL_735542 (CHEMBL1693047)
Ki
5.1±n/a nM
Citation
 Pacchiano, FCarta, FMcDonald, PCLou, YVullo, DScozzafava, ADedhar, SSupuran, CT Ureido-substituted benzenesulfonamides potently inhibit carbonic anhydrase IX and show antimetastatic activity in a model of breast cancer metastasis. J Med Chem 54:1896-902 (2011)  
Target
Name:
Carbonic anhydrase 12
Synonyms:
CA-XII CAH12_HUMAN Carbonic anhydrase Carbonic anhydrase XII Carbonic anhydrase XII (CAXII) | Tumor antigen HOM-RCC-3.1.3
Type:
Enzyme
Mol. Mass.:
39456.00
Organism:
Homo sapiens (Human)
Description:
Catalytic domain of human cloned isozyme was used in the assay
Residue:
354
  
Inhibitor
Name:
BDBM50146756
Synonyms:
4-(3-Pentafluorophenyl-ureido)-benzenesulfonamide | CHEMBL316779
Type:
Small organic molecule
Emp. Form.:
C13H8F5N3O3S
Mol. Mass.:
381.278
SMILES:
NS(=O)(=O)c1ccc(NC(=O)Nc2c(F)c(F)c(F)c(F)c2F)cc1
: