Target
Carbonic anhydrase 12
Ligand
BDBM50334349
Substrate
Meas. Tech.
ChEMBL_735542 (CHEMBL1693047)
Ki
5.7±n/a nM
Citation
 Pacchiano, FCarta, FMcDonald, PCLou, YVullo, DScozzafava, ADedhar, SSupuran, CT Ureido-substituted benzenesulfonamides potently inhibit carbonic anhydrase IX and show antimetastatic activity in a model of breast cancer metastasis. J Med Chem 54:1896-902 (2011)  
Target
Name:
Carbonic anhydrase 12
Synonyms:
CA-XII CAH12_HUMAN Carbonic anhydrase Carbonic anhydrase XII Carbonic anhydrase XII (CAXII) | Tumor antigen HOM-RCC-3.1.3
Type:
Enzyme
Mol. Mass.:
39456.00
Organism:
Homo sapiens (Human)
Description:
Catalytic domain of human cloned isozyme was used in the assay
Residue:
354
  
Inhibitor
Name:
BDBM50334349
Synonyms:
4-(3-(3-nitrophenyl)ureido)benzenesulfonamide 4-{[(3-nitrophenyl)carbamoyl]amino}benzenesulfonamide CHEMBL1614844
Type:
Small organic molecule
Emp. Form.:
C13H12N4O5S
Mol. Mass.:
336.323
SMILES:
NS(=O)(=O)c1ccc(NC(=O)Nc2cccc(c2)[N+]([O-])=O)cc1
: