Target
Carbonic anhydrase 1
Ligand
BDBM26981
Substrate
Meas. Tech.
ChEMBL_735670 (CHEMBL1693485)
pH
7.5±n/a
Ki
300000±n/a nM
Comments
extracted
Citation
 Cincinelli, AMartellini, TInnocenti, AScozzafava, ASupuran, CT Purification and inhibition studies with anions and sulfonamides of ana-carbonic anhydrase from the Antarctic seal Leptonychotes weddellii. Bioorg Med Chem 19:1847-51 (2011)  
Target
Name:
Carbonic anhydrase 1
Synonyms:
CA-I CAB Carbonate dehydratase I Carbonic anhydrase 1 (CA I) Carbonic anhydrase 1 (Recombinant CA I) Carbonic anhydrase B Carbonic anhydrase I (CA I) Carbonic anhydrase I (CAI) Carbonic anhydrase isoenzyme I (hCA I) | hCA
Type:
Enzyme
Mol. Mass.:
28873.37
Organism:
Homo sapiens (Human)
Description:
P00915
Residue:
261
  
Inhibitor
Name:
BDBM26981
Synonyms:
CHEMBL1644695 POTASSIUM IODIDE iodide ion
Type:
Ion
Emp. Form.:
I
Mol. Mass.:
126.90502
SMILES:
[I-]
: