Target
11-beta-hydroxysteroid dehydrogenase type 2
Ligand
BDBM50340808
Substrate
Meas. Tech.
ChEMBL_740565 (CHEMBL1764828)
IC50
>4000±n/a nM
Citation
 Sun, WMaletic, MMundt, SSShah, KZokian, HLyons, KWaddell, STBalkovec, J Substituted phenyl triazoles as selective inhibitors of 11 β-Hydroxysteroid Dehydrogenase Type 1. Bioorg Med Chem Lett 21:2141-5 (2011)  
Target
Name:
11-beta-hydroxysteroid dehydrogenase type 2
Synonyms:
11-DH2 11-beta-Hydroxysteroid Dehydrogenase 2 (11-beta-HSD2) 11-beta-hydroxysteroid dehydrogenase 2 11-beta-hydroxysteroid dehydrogenase type 2 (11-beta-HSD2) DHI2_HUMAN HSD11K SDR9C3
Type:
Enzyme
Mol. Mass.:
44141.72
Organism:
Homo sapiens (Human)
Description:
Purified recombinant human 11beta-HSD2.
Residue:
405
  
Inhibitor
Name:
BDBM50340808
Synonyms:
CHEMBL1760690 | N-(3-chloro-4-(5-(1-(4-chlorophenyl)cyclobutyl)-4-methyl-4H-1,2,4-triazol-3-yl)phenyl)pyrazine-2-carboxamide
Type:
Small organic molecule
Emp. Form.:
C24H20Cl2N6O
Mol. Mass.:
479.361
SMILES:
Cn1c(nnc1C1(CCC1)c1ccc(Cl)cc1)-c1ccc(NC(=O)c2cnccn2)cc1Cl
: