Target
Amine oxidase [flavin-containing] A
Ligand
BDBM50341152
Substrate
Meas. Tech.
ChEMBL_740451 (CHEMBL1764565)
Ki
20.14±n/a nM
Citation
 Mishra, NSasmal, D Development of selective and reversible pyrazoline based MAO-B inhibitors: virtual screening, synthesis and biological evaluation. Bioorg Med Chem Lett 21:1969-73 (2011)  
Target
Name:
Amine oxidase [flavin-containing] A
Synonyms:
AOFA_RAT Amine oxidase [flavin-containing] A Monoamine Oxidase Type A (MAO-A) Monoamine oxidase A (MAO-A) Monoamine oxidase type A (MAOA)
Type:
Enzyme
Mol. Mass.:
59515.21
Organism:
Rattus norvegicus (rat)
Description:
Residue:
526
  
Inhibitor
Name:
BDBM50341152
Synonyms:
3-(anthracen-9-yl)-5-(4-nitrophenyl)-4,5-dihydro-1H-pyrazole | CHEMBL1760713
Type:
Small organic molecule
Emp. Form.:
C23H17N3O2
Mol. Mass.:
367.4
SMILES:
[O-][N+](=O)c1ccc(cc1)C1CC(N=N1)c1c2ccccc2cc2ccccc12
: