Target
Amine oxidase [flavin-containing] A
Ligand
BDBM50341157
Substrate
Meas. Tech.
ChEMBL_740451 (CHEMBL1764565)
Ki
77.61±n/a nM
Citation
 Mishra, NSasmal, D Development of selective and reversible pyrazoline based MAO-B inhibitors: virtual screening, synthesis and biological evaluation. Bioorg Med Chem Lett 21:1969-73 (2011)  
Target
Name:
Amine oxidase [flavin-containing] A
Synonyms:
AOFA_RAT Amine oxidase [flavin-containing] A Monoamine Oxidase Type A (MAO-A) Monoamine oxidase A (MAO-A) Monoamine oxidase type A (MAOA)
Type:
Enzyme
Mol. Mass.:
59515.21
Organism:
Rattus norvegicus (rat)
Description:
Residue:
526
  
Inhibitor
Name:
BDBM50341157
Synonyms:
2-(3-(anthracen-9-yl)-4,5-dihydro-1H-pyrazol-5-yl)phenol | CHEMBL1760718
Type:
Small organic molecule
Emp. Form.:
C23H18N2O
Mol. Mass.:
338.4018
SMILES:
Oc1ccccc1C1CC(N=N1)c1c2ccccc2cc2ccccc12
: