Target
Amine oxidase [flavin-containing] A
Ligand
BDBM50341158
Substrate
Meas. Tech.
ChEMBL_740451 (CHEMBL1764565)
Ki
95.65±n/a nM
Citation
 Mishra, NSasmal, D Development of selective and reversible pyrazoline based MAO-B inhibitors: virtual screening, synthesis and biological evaluation. Bioorg Med Chem Lett 21:1969-73 (2011)  
Target
Name:
Amine oxidase [flavin-containing] A
Synonyms:
AOFA_RAT Amine oxidase [flavin-containing] A Monoamine Oxidase Type A (MAO-A) Monoamine oxidase A (MAO-A) Monoamine oxidase type A (MAOA)
Type:
Enzyme
Mol. Mass.:
59515.21
Organism:
Rattus norvegicus (rat)
Description:
Residue:
526
  
Inhibitor
Name:
BDBM50341158
Synonyms:
4-(3-(anthracen-9-yl)-4,5-dihydro-1H-pyrazol-5-yl)benzene-1,3-diol | CHEMBL1760719
Type:
Small organic molecule
Emp. Form.:
C23H18N2O2
Mol. Mass.:
354.4012
SMILES:
Oc1ccc(C2CC(N=N2)c2c3ccccc3cc3ccccc23)c(O)c1
: