Target
Amine oxidase [flavin-containing] A
Ligand
BDBM50341159
Substrate
Meas. Tech.
ChEMBL_740451 (CHEMBL1764565)
Ki
241.54±n/a nM
Citation
 Mishra, NSasmal, D Development of selective and reversible pyrazoline based MAO-B inhibitors: virtual screening, synthesis and biological evaluation. Bioorg Med Chem Lett 21:1969-73 (2011)  
Target
Name:
Amine oxidase [flavin-containing] A
Synonyms:
AOFA_RAT Amine oxidase [flavin-containing] A Monoamine Oxidase Type A (MAO-A) Monoamine oxidase A (MAO-A) Monoamine oxidase type A (MAOA)
Type:
Enzyme
Mol. Mass.:
59515.21
Organism:
Rattus norvegicus (rat)
Description:
Residue:
526
  
Inhibitor
Name:
BDBM50341159
Synonyms:
2-(3-(anthracen-9-yl)-4,5-dihydro-1H-pyrazol-5-yl)pyridine | CHEMBL1760720
Type:
Small organic molecule
Emp. Form.:
C22H17N3
Mol. Mass.:
323.3905
SMILES:
C1C(N=NC1c1c2ccccc2cc2ccccc12)c1ccccn1
: