Target
Neuronal acetylcholine receptor subunit alpha-3/beta-4
Ligand
BDBM50322531
Substrate
Meas. Tech.
ChEMBL_741838 (CHEMBL1769983)
IC50
1600±n/a nM
Citation
 Carroll, FIMuresan, AZBlough, BENavarro, HAMascarella, SWEaton, JBHuang, XDamaj, MILukas, RJ Synthesis of 2-(substituted phenyl)-3,5,5-trimethylmorpholine analogues and their effects on monoamine uptake, nicotinic acetylcholine receptor function, and behavioral effects of nicotine. J Med Chem 54:1441-8 (2011)  
Target
Name:
Neuronal acetylcholine receptor subunit alpha-3/beta-4
Synonyms:
Neuronal acetylcholine receptor protein alpha-3/beta-4 subunit | Neuronal acetylcholine receptor; alpha3/beta4
Type:
Mol. Mass.:
Description:
ASSAY_ID of ChEMBL is 1970247
Components:
This complex has 2 components.
Component 1
Name:
Neuronal acetylcholine receptor subunit beta-4
Synonyms:
ACHB4_HUMAN Cholinergic, Nicotinic Alpha6Beta3Beta4Alpha5 Nicotinic acetylcholine receptor alpha6/alpha3/beta4
Type:
Enzyme Catalytic Domain
Mol. Mass.:
56388.51
Organism:
Homo sapiens (Human)
Description:
Cholinergic, Nicotinic Alpha6Beta3Beta4Alpha5 0 HUMAN::P30926
Residue:
498
  
Component 2
Name:
Neuronal acetylcholine receptor subunit alpha-3
Synonyms:
ACHA3_HUMAN Cholinergic, Nicotinic Alpha3Beta2 Cholinergic, Nicotinic Alpha3Beta4x NACHRA3 Neuronal acetylcholine receptor subunit alpha-3 nicotinic central
Type:
Enzyme Catalytic Domain
Mol. Mass.:
57479.03
Organism:
Homo sapiens (Human)
Description:
Cholinergic, Nicotinic Alpha3Beta2 0 HUMAN::P32297
Residue:
505
  
Inhibitor
Name:
BDBM50322531
Synonyms:
(2R,3R)-2-(3-Chlorophenyl)-3,5,5-trimethylmorpholin-2-ol | CHEMBL1172929
Type:
Small organic molecule
Emp. Form.:
C13H18ClNO2
Mol. Mass.:
255.741
SMILES:
C[C@H]1NC(C)(C)CO[C@]1(O)c1cccc(Cl)c1
: