Target
Aurora kinase A
Ligand
BDBM50418250
Substrate
Meas. Tech.
ChEMBL_742330 (CHEMBL1768779)
IC50
1585±n/a nM
Citation
 Medina, JRBecker, CJBlackledge, CWDuquenne, CFeng, YGrant, SWHeerding, DLi, WHMiller, WHRomeril, SPScherzer, DShu, ABobko, MAChadderton, ARDumble, MGardiner, CMGilbert, SLiu, QRabindran, SKSudakin, VXiang, HBrady, PGCampobasso, NWard, PAxten, JM Structure-based design of potent and selective 3-phosphoinositide-dependent kinase-1 (PDK1) inhibitors. J Med Chem 54:1871-95 (2011)  
Target
Name:
Aurora kinase A
Synonyms:
AIK ARK-1 AURA AURKA_HUMAN Aurora 2 Aurora kinase A (AURKA) Aurora kinase A (Aurora-2) Aurora/IPL1-related kinase 1 Breast tumor-amplified kinase IAK1 STK15 GN Serine/threonine kinase 15 Serine/threonine-protein kinase 6 Serine/threonine-protein kinase aurora-A aurora-2 | hARK1
Type:
Serine/threonine-protein kinase
Mol. Mass.:
45830.98
Organism:
Homo sapiens (Human)
Description:
O14965
Residue:
403
  
Inhibitor
Name:
BDBM50418250
Synonyms:
CHEMBL1765748
Type:
Small organic molecule
Emp. Form.:
C21H28N8O2
Mol. Mass.:
424.4994
SMILES:
CC(C)(C)OC(=O)N[C@@H]1CCCN(C1)c1cc(nc(N)n1)-c1ccc2c(N)n[nH]c2c1
: