Target
Aurora kinase B
Ligand
BDBM50418241
Substrate
Meas. Tech.
ChEMBL_742331 (CHEMBL1768780)
IC50
3162±n/a nM
Citation
 Medina, JRBecker, CJBlackledge, CWDuquenne, CFeng, YGrant, SWHeerding, DLi, WHMiller, WHRomeril, SPScherzer, DShu, ABobko, MAChadderton, ARDumble, MGardiner, CMGilbert, SLiu, QRabindran, SKSudakin, VXiang, HBrady, PGCampobasso, NWard, PAxten, JM Structure-based design of potent and selective 3-phosphoinositide-dependent kinase-1 (PDK1) inhibitors. J Med Chem 54:1871-95 (2011)  
Target
Name:
Aurora kinase B
Synonyms:
AIK2 AIM1 ARK2 AURKB_HUMAN Aurora B-INCENP Aurora kinase B (AURKB) STK-1 STK12 Serine/threonine-protein kinase aurora B
Type:
Protein
Mol. Mass.:
39327.72
Organism:
Homo sapiens (Human)
Description:
Q96GD4
Residue:
344
  
Inhibitor
Name:
BDBM50418241
Synonyms:
CHEMBL1614774
Type:
Small organic molecule
Emp. Form.:
C22H22N8O2
Mol. Mass.:
430.4625
SMILES:
Nc1[nH]nc2cc(ccc12)-c1cc(nc(N)n1)N1CCO[C@@H](C1)C(=O)Nc1ccccc1
: