Target
Solute carrier family 15 member 1
Ligand
BDBM50341599
Substrate
Meas. Tech.
ChEMBL_744113 (CHEMBL1767474)
IC50
600000±n/a nM
Citation
 Flaten, GEKottra, GStensen, WIsaksen, GKarstad, RSvendsen, JSDaniel, HSvenson, J In vitro characterization of human peptide transporter hPEPT1 interactions and passive permeation studies of short cationic antimicrobial peptides. J Med Chem 54:2422-32 (2011)  
Target
Name:
Solute carrier family 15 member 1
Synonyms:
Intestinal H(+)/peptide cotransporter Oligopeptide transporter, small intestine isoform Peptide transporter 1 SLC15A1
Type:
PROTEIN
Mol. Mass.:
78818.07
Organism:
Homo sapiens (Human)
Description:
ChEMBL_1488839
Residue:
708
  
Inhibitor
Name:
BDBM50341599
Synonyms:
(S)-2-((S)-2-amino-3-(2,5,7-tri-tert-butyl-1H-indol-3-yl)propanamido)-5-guanidinopentanamide CHEMBL365705 | TbtR-NH2
Type:
Small organic molecule
Emp. Form.:
C29H49N7O2
Mol. Mass.:
527.7451
SMILES:
CC(C)(C)c1[nH]c2c(cc(cc2c1C[C@H](N)C(=O)N[C@@H](CCCNC(N)=N)C(N)=O)C(C)(C)C)C(C)(C)C
: