Target
Solute carrier family 15 member 1
Ligand
BDBM50341600
Substrate
Meas. Tech.
ChEMBL_744113 (CHEMBL1767474)
IC50
2700000±n/a nM
Citation
 Flaten, GEKottra, GStensen, WIsaksen, GKarstad, RSvendsen, JSDaniel, HSvenson, J In vitro characterization of human peptide transporter hPEPT1 interactions and passive permeation studies of short cationic antimicrobial peptides. J Med Chem 54:2422-32 (2011)  
Target
Name:
Solute carrier family 15 member 1
Synonyms:
Intestinal H(+)/peptide cotransporter Oligopeptide transporter, small intestine isoform Peptide transporter 1 SLC15A1
Type:
PROTEIN
Mol. Mass.:
78818.07
Organism:
Homo sapiens (Human)
Description:
ChEMBL_1488839
Residue:
708
  
Inhibitor
Name:
BDBM50341600
Synonyms:
(S)-2-amino-N-((S)-1-((S)-1-amino-5-guanidino-1-oxopentan-2-ylamino)-3-(1H-indol-3-yl)-1-oxopropan-2-yl)-5-guanidinopentanamide CHEMBL41644
Type:
Small organic molecule
Emp. Form.:
C23H37N11O3
Mol. Mass.:
515.6118
SMILES:
N[C@@H](CCCNC(N)=N)C(=O)N[C@@H](Cc1c[nH]c2ccccc12)C(=O)N[C@@H](CCCNC(N)=N)C(N)=O
: