Target
M-phase inducer phosphatase 2
Ligand
BDBM50106497
Substrate
Meas. Tech.
ChEMBL_743507 (CHEMBL1767948)
Ki
95±n/a nM
Citation
 Vintonyak, VVWaldmann, HRauh, D Using small molecules to target protein phosphatases. Bioorg Med Chem 19:2145-55 (2011)  
Target
Name:
M-phase inducer phosphatase 2
Synonyms:
CDC25B Dual specificity phosphatase (CDC25B) M-phase inducer phosphatase 2 (CDC25B) | MPIP2_HUMAN
Type:
Protein
Mol. Mass.:
64985.27
Organism:
Homo sapiens (Human)
Description:
Residue:
580
  
Inhibitor
Name:
BDBM50106497
Synonyms:
6-Chloro-7-(2-morpholin-4-yl-ethylamino)-quinoline-5,8-dione CHEMBL337173 | NSC-663284
Type:
Small organic molecule
Emp. Form.:
C15H16ClN3O3
Mol. Mass.:
321.759
SMILES:
Oc1c(Cl)c(N=CCN2CCOCC2)c(O)c2ncccc12
: