Target
Arabinose 5-phosphate isomerase KdsD
Ligand
BDBM50148765
Substrate
Meas. Tech.
ChEMBL_744987 (CHEMBL1772002)
IC50
7000±n/a nM
Citation
 Yep, ASorenson, RJWilson, MRShowalter, HDLarsen, SDKeller, PRWoodard, RW Enediol mimics as inhibitors of the D-arabinose 5-phosphate isomerase (KdsD) from Francisella tularensis. Bioorg Med Chem Lett 21:2679-82 (2011)  
Target
Name:
Arabinose 5-phosphate isomerase KdsD
Synonyms:
Arabinose phosphate isomerase kdsD
Type:
PROTEIN
Mol. Mass.:
35692.42
Organism:
Francisella tularensis subsp. tularensis
Description:
ChEMBL_744987
Residue:
327
  
Inhibitor
Name:
BDBM50148765
Synonyms:
1-(hydroxyamino)-1-oxo-4-(phosphonooxy)butane-2,3-diyl diacetate CHEMBL114269
Type:
Small organic molecule
Emp. Form.:
C8H14NO10P
Mol. Mass.:
315.1712
SMILES:
CC(=O)O[C@H](COP(O)(O)=O)[C@@H](OC(C)=O)C(=O)NO
: