Target
Metabotropic glutamate receptor 1
Ligand
BDBM50301822
Substrate
Meas. Tech.
ChEMBL_744512 (CHEMBL1772533)
Ki
0.400000±n/a nM
Citation
 Yamasaki, TFujinaga, MYoshida, YKumata, KYui, JKawamura, KHatori, AFukumura, TZhang, MR Radiosynthesis and preliminary evaluation of 4-[18F]fluoro-N-[4-[6-(isopropylamino)pyrimidin-4-yl]-1,3-thiazol-2-yl]-N-methylbenzamide as a new positron emission tomography ligand for metabotropic glutamate receptor subtype 1. Bioorg Med Chem Lett 21:2998-3001 (2011)  
Target
Name:
Metabotropic glutamate receptor 1
Synonyms:
GPRC1A GRM1_HUMAN Metabotropic Glutamate 1a | metabotropic glutamate 1
Type:
Enzyme
Mol. Mass.:
132358.19
Organism:
Homo sapiens (Human)
Description:
Q13255
Residue:
1194
  
Inhibitor
Name:
BDBM50301822
Synonyms:
5-(1-(2-fluoropyridin-3-yl)-5-methyl-1H-1,2,3-triazol-4-yl)-2-propylisoindolin-1-one CHEMBL568443
Type:
Small organic molecule
Emp. Form.:
C19H18FN5O
Mol. Mass.:
351.3775
SMILES:
CCCN1Cc2cc(ccc2C1=O)-c1nnn(c1C)-c1cccnc1F
: