Target
Prostaglandin G/H synthase 1
Ligand
BDBM50242014
Substrate
Meas. Tech.
ChEMBL_745544 (CHEMBL1775861)
IC50
100000±n/a nM
Citation
 Hošek, JBartos, MChudík, SDall'Acqua, SInnocenti, GKartal, MKokoška, LKollár, PKutil, ZLanda, PMarek, RZávalová, VŽemlička, MŠmejkal, K Natural compound cudraflavone B shows promising anti-inflammatory properties in vitro. J Nat Prod 74:614-9 (2011)  
Target
Name:
Prostaglandin G/H synthase 1
Synonyms:
COX1 Cyclooxygenase-1 (COX-1) PTGS1 | Prostaglandin G/H synthase (cyclooxygenase)
Type:
Protein
Mol. Mass.:
68868.60
Organism:
Ovis aries (Sheep)
Description:
Residue:
600
  
Inhibitor
Name:
BDBM50242014
Synonyms:
CHEMBL464006 Morusin, 3 cid_5281671
Type:
Small organic molecule
Emp. Form.:
C25H24O6
Mol. Mass.:
420.4545
SMILES:
[#6]\[#6](-[#6])=[#6]\[#6]-c1c(oc2c3-[#6]=[#6]C([#6])([#6])[#8]-c3cc(-[#8])c2c1=O)-c1ccc(-[#8])cc1-[#8]
: