Target
Delta-type opioid receptor
Ligand
BDBM50343253
Substrate
Meas. Tech.
ChEMBL_745569 (CHEMBL1775886)
Ki
>5000±n/a nM
Citation
 Lozama, ACunningham, CWCaspers, MJDouglas, JTDersch, CMRothman, RBPrisinzano, TE Opioid receptor probes derived from cycloaddition of the hallucinogen natural product salvinorin A. J Nat Prod 74:718-26 (2011)  
Target
Name:
Delta-type opioid receptor
Synonyms:
D-OR-1 Delta opioid receptor OPIATE Delta OPRD1 OPRK1 | opioid receptor, delta 1
Type:
G Protein-Coupled Receptor (GPCR)
Mol. Mass.:
40382.98
Organism:
Homo sapiens (Human)
Description:
Competition binding assays were carried out using membrane preparations from transfected HN9.10 cells that constitutively expressed the delta opioid receptor.
Residue:
372
  
Inhibitor
Name:
BDBM50343253
Synonyms:
CHEMBL1773748 | Dimethyl 5-((2S,4aR,6aR,7R,9S,10aS,10bR)-9-acetoxy-7-(methoxycarbonyl)-6a,10b-dimethyl-4,10-dioxododecahydro-1H-benzo[f]isochromen-2-yl)-7-oxabicyclo[2.2.1]hepta-2,5-diene-2,3-dicarboxylate
Type:
Small organic molecule
Emp. Form.:
C29H34O12
Mol. Mass.:
574.5731
SMILES:
COC(=O)[C@@H]1C[C@H](OC(C)=O)C(=O)[C@H]2[C@@]1(C)CC[C@H]1C(=O)O[C@@H](C[C@]21C)C1=CC2OC1C(C(=O)OC)=C2C(=O)OC
: