Target
Mu-type opioid receptor
Ligand
BDBM50343251
Substrate
Meas. Tech.
ChEMBL_745576 (CHEMBL1775893)
Ki
>3000±n/a nM
Citation
 Lozama, ACunningham, CWCaspers, MJDouglas, JTDersch, CMRothman, RBPrisinzano, TE Opioid receptor probes derived from cycloaddition of the hallucinogen natural product salvinorin A. J Nat Prod 74:718-26 (2011)  
Target
Name:
Mu-type opioid receptor
Synonyms:
M-OR-1 MOR-1 MUOR1 Mu opiate receptor OPRM1 hMOP | mu-type opioid receptor isoform MOR-1
Type:
G Protein-Coupled Receptor (GPCR)
Mol. Mass.:
44789.51
Organism:
Homo sapiens (Human)
Description:
P35372
Residue:
400
  
Inhibitor
Name:
BDBM50343251
Synonyms:
(2S,4aR,6aR,7R,9S,10aS,10bR)-Methyl 9-acetoxy-6a,10bdimethyl-2-(naphthalen-2-yl)-4,10-dioxododecahydro-1Hbenzo[f]isochromene-7-carboxylate | CHEMBL1773754
Type:
Small organic molecule
Emp. Form.:
C29H32O7
Mol. Mass.:
492.5602
SMILES:
COC(=O)[C@@H]1C[C@H](OC(C)=O)C(=O)[C@H]2[C@@]1(C)CC[C@H]1C(=O)O[C@@H](C[C@]21C)c1ccc2ccccc2c1
: