Target
Kappa-type opioid receptor
Ligand
BDBM50343250
Substrate
Meas. Tech.
ChEMBL_745571 (CHEMBL1775888)
Ki
286±n/a nM
Citation
 Lozama, ACunningham, CWCaspers, MJDouglas, JTDersch, CMRothman, RBPrisinzano, TE Opioid receptor probes derived from cycloaddition of the hallucinogen natural product salvinorin A. J Nat Prod 74:718-26 (2011)  
Target
Name:
Kappa-type opioid receptor
Synonyms:
K-OR-1 Kappa-opioid receptor (KOR) Kappa-type opioid receptor (KOR) OPIATE Kappa OPRK1 kappa opioid receptor (KOR)
Type:
G Protein-Coupled Receptor (GPCR)
Mol. Mass.:
42648.76
Organism:
Homo sapiens (Human)
Description:
P41145
Residue:
380
  
Inhibitor
Name:
BDBM50343250
Synonyms:
CHEMBL1773753 | Dimethyl 4-((2S,4aR,6aR,7R,9S,10aS,10bR)-9-acetoxy-7-(methoxycarbonyl)-6a,10b-dimethyl-4,10-dioxododecahydro-1H-benzo[f]isochromen-2-yl)phthalate
Type:
Small organic molecule
Emp. Form.:
C29H34O11
Mol. Mass.:
558.5737
SMILES:
COC(=O)[C@@H]1C[C@H](OC(C)=O)C(=O)[C@H]2[C@@]1(C)CC[C@H]1C(=O)O[C@@H](C[C@]21C)c1ccc(C(=O)OC)c(c1)C(=O)OC
: