Target
Mu-type opioid receptor
Ligand
BDBM50343252
Substrate
Meas. Tech.
ChEMBL_745576 (CHEMBL1775893)
Ki
>3200±n/a nM
Citation
 Lozama, ACunningham, CWCaspers, MJDouglas, JTDersch, CMRothman, RBPrisinzano, TE Opioid receptor probes derived from cycloaddition of the hallucinogen natural product salvinorin A. J Nat Prod 74:718-26 (2011)  
Target
Name:
Mu-type opioid receptor
Synonyms:
M-OR-1 MOR-1 MUOR1 Mu opiate receptor OPRM1 hMOP | mu-type opioid receptor isoform MOR-1
Type:
G Protein-Coupled Receptor (GPCR)
Mol. Mass.:
44789.51
Organism:
Homo sapiens (Human)
Description:
P35372
Residue:
400
  
Inhibitor
Name:
BDBM50343252
Synonyms:
CHEMBL1773747 | Diethyl 5-((2S,4aR,6aR,7R,9S,10aS,10bR)-9-acetoxy-7-(methoxycarbonyl)-6a,10b-dimethyl-4,10-dioxododecahydro-1H-benzo[f]isochromen-2-yl)-7-oxabicyclo[2.2.1]hepta-2,5-diene-2,3-dicarboxylate
Type:
Small organic molecule
Emp. Form.:
C31H38O12
Mol. Mass.:
602.6262
SMILES:
CCOC(=O)C1=C(C2OC1C=C2[C@@H]1C[C@@]2(C)[C@@H](CC[C@@]3(C)[C@@H](C[C@H](OC(C)=O)C(=O)[C@H]23)C(=O)OC)C(=O)O1)C(=O)OCC
: