Target
Sigma non-opioid intracellular receptor 1
Ligand
BDBM81982
Substrate
Meas. Tech.
ChEMBL_746058 (CHEMBL1775445)
Ki
69.4±n/a nM
Citation
 Marrazzo, ACobos, EJParenti, CAricò, GMarrazzo, GRonsisvalle, SPasquinucci, LPrezzavento, OColabufo, NAContino, MGonzález, LGScoto, GMRonsisvalle, G Novel potent and selectives ligands: evaluation of their agonist and antagonist properties. J Med Chem 54:3669-73 (2011)  
Target
Name:
Sigma non-opioid intracellular receptor 1
Synonyms:
OPRS1 SIGMAR1 Sigma non-opioid intracellular receptor 1 Sigma1-receptor Sterol isomerase-like protein
Type:
Protein
Mol. Mass.:
25307.17
Organism:
Cavia porcellus (Guinea pig)
Description:
Q60492
Residue:
223
  
Inhibitor
Name:
BDBM81982
Synonyms:
CAS_97-39-2 DTG Tol2Gdn | cid_7333
Type:
Small organic molecule
Emp. Form.:
C15H17N3
Mol. Mass.:
239.3156
SMILES:
Cc1ccccc1NC(N)=Nc1ccccc1C
: