Target
D(3) dopamine receptor
Ligand
BDBM50343785
Substrate
Meas. Tech.
ChEMBL_747598 (CHEMBL1777179)
Ki
6.1±n/a nM
Citation
 Banala, AKLevy, BAKhatri, SSFurman, CARoof, RAMishra, YGriffin, SASibley, DRLuedtke, RRNewman, AH N-(3-fluoro-4-(4-(2-methoxy or 2,3-dichlorophenyl)piperazine-1-yl)butyl)arylcarboxamides as selective dopamine D3 receptor ligands: critical role of the carboxamide linker for D3 receptor selectivity. J Med Chem 54:3581-94 (2011)  
Target
Name:
D(3) dopamine receptor
Synonyms:
DOPAMINE D3 DRD3_HUMAN Dopamine D3 receptor (D3) Dopamine receptor Dopamine receptor D3
Type:
Mol. Mass.:
44243.43
Organism:
Homo sapiens (Human)
Description:
Residue:
400
  
Inhibitor
Name:
BDBM50343785
Synonyms:
CHEMBL1774386 | N-(4-(4-(2,3-Dichlorophenyl)piperazin-1-yl)-3-fluorobutyl)-benzofuran-2-carboxamide
Type:
Small organic molecule
Emp. Form.:
C23H24Cl2FN3O2
Mol. Mass.:
464.36
SMILES:
FC(CCNC(=O)c1cc2ccccc2o1)CN1CCN(CC1)c1cccc(Cl)c1Cl
: