Target
Sphingosine kinase 2
Ligand
BDBM50343829
Substrate
Meas. Tech.
ChEMBL_747638 (CHEMBL1777256)
Ki
1500±n/a nM
Citation
 Kennedy, AJMathews, TPKharel, YField, SDMoyer, MLEast, JEHouck, JDLynch, KRMacdonald, TL Development of amidine-based sphingosine kinase 1 nanomolar inhibitors and reduction of sphingosine 1-phosphate in human leukemia cells. J Med Chem 54:3524-48 (2011)  
Target
Name:
Sphingosine kinase 2
Synonyms:
SK 2 SPK 2 Sphingosine kinase 2 (SPHK2) | Sphk2
Type:
Enzyme
Mol. Mass.:
65617.92
Organism:
Mus musculus (Mouse)
Description:
Q9JIA7
Residue:
617
  
Inhibitor
Name:
BDBM50343829
Synonyms:
(S)-1-(4-Dodecylbenzoyl)pyrrolidine-2-carboximidamide Hydrochloride | CHEMBL1774571
Type:
Small organic molecule
Emp. Form.:
C24H39N3O
Mol. Mass.:
385.586
SMILES:
CCCCCCCCCCCCc1ccc(cc1)C(=O)N1CCC[C@H]1C(N)=N
: