Target
Free fatty acid receptor 1
Ligand
BDBM50344083
Substrate
Meas. Tech.
ChEMBL_748546 (CHEMBL1780399)
EC50
954±n/a nM
Citation
 Walsh, SPSeverino, AZhou, CHe, JLiang, GBTan, CPCao, JEiermann, GJXu, LSalituro, GHoward, ADMills, SGYang, L 3-Substituted 3-(4-aryloxyaryl)-propanoic acids as GPR40 agonists. Bioorg Med Chem Lett 21:3390-4 (2011)  
Target
Name:
Free fatty acid receptor 1
Synonyms:
FFAR1 G-protein Coupled Receptor 40 | GPR40
Type:
G Protein-Coupled Receptor (GPCR)
Mol. Mass.:
31473.32
Organism:
Homo sapiens (Human)
Description:
O14842
Residue:
300
  
Inhibitor
Name:
BDBM50344083
Synonyms:
CHEMBL1777871 | rac-5-(1-(4-(benzyloxy)phenyl)but-2-ynyl)oxazolidine-2,4-dione
Type:
Small organic molecule
Emp. Form.:
C20H17NO4
Mol. Mass.:
335.3533
SMILES:
CC#CC(c1oc(=O)[nH]c1O)c1ccc(OCc2ccccc2)cc1
: