Target
Voltage-dependent L-type calcium channel subunit alpha-1C
Ligand
BDBM50344080
Substrate
Meas. Tech.
ChEMBL_748606 (CHEMBL1780459)
IC50
25600±n/a nM
Citation
 Walsh, SPSeverino, AZhou, CHe, JLiang, GBTan, CPCao, JEiermann, GJXu, LSalituro, GHoward, ADMills, SGYang, L 3-Substituted 3-(4-aryloxyaryl)-propanoic acids as GPR40 agonists. Bioorg Med Chem Lett 21:3390-4 (2011)  
Target
Name:
Voltage-dependent L-type calcium channel subunit alpha-1C
Synonyms:
CAC1C_HUMAN CACN2 CACNL1A1 Calcium channel (Type L) L-type calcium channel alpha-1c/beta-2/alpha2delta-1 Voltage-gated L-type calcium channel Voltage-gated calcium channel | Voltage-gated calcium channel subunit alpha Cav1.2
Type:
Enzyme Catalytic Domain
Mol. Mass.:
248979.79
Organism:
Homo sapiens (Human)
Description:
Calcium channel (Type L) 0 HUMAN::Q13936
Residue:
2221
  
Inhibitor
Name:
BDBM50344080
Synonyms:
CHEMBL1777855 | rac-3-(4-(2-(difluoromethoxy)-4-(trifluoromethyl)phenoxy)-2-fluorophenyl)hex-4-ynoic acid
Type:
Small organic molecule
Emp. Form.:
C20H14F6O4
Mol. Mass.:
432.3132
SMILES:
CC#CC(CC(O)=O)c1ccc(Oc2ccc(cc2OC(F)F)C(F)(F)F)cc1F
: