Target
Free fatty acid receptor 1
Ligand
BDBM50344077
Substrate
Meas. Tech.
ChEMBL_748591 (CHEMBL1780444)
IC50
42±n/a nM
Citation
 Walsh, SPSeverino, AZhou, CHe, JLiang, GBTan, CPCao, JEiermann, GJXu, LSalituro, GHoward, ADMills, SGYang, L 3-Substituted 3-(4-aryloxyaryl)-propanoic acids as GPR40 agonists. Bioorg Med Chem Lett 21:3390-4 (2011)  
Target
Name:
Free fatty acid receptor 1
Synonyms:
FFAR1 G-protein Coupled Receptor 40 | GPR40
Type:
G Protein-Coupled Receptor (GPCR)
Mol. Mass.:
31473.32
Organism:
Homo sapiens (Human)
Description:
O14842
Residue:
300
  
Inhibitor
Name:
BDBM50344077
Synonyms:
3-(4-((R)-2,3-dihydro-1H-inden-1-yloxy)phenyl)hex-4-ynoic acid | CHEMBL1777870
Type:
Small organic molecule
Emp. Form.:
C21H20O3
Mol. Mass.:
320.3817
SMILES:
CC#CC(CC(O)=O)c1ccc(O[C@@H]2CCc3ccccc23)cc1
: