Target
Free fatty acid receptor 1
Ligand
BDBM50344082
Substrate
Meas. Tech.
ChEMBL_748591 (CHEMBL1780444)
IC50
10000±n/a nM
Citation
 Walsh, SPSeverino, AZhou, CHe, JLiang, GBTan, CPCao, JEiermann, GJXu, LSalituro, GHoward, ADMills, SGYang, L 3-Substituted 3-(4-aryloxyaryl)-propanoic acids as GPR40 agonists. Bioorg Med Chem Lett 21:3390-4 (2011)  
Target
Name:
Free fatty acid receptor 1
Synonyms:
FFAR1 G-protein Coupled Receptor 40 | GPR40
Type:
G Protein-Coupled Receptor (GPCR)
Mol. Mass.:
31473.32
Organism:
Homo sapiens (Human)
Description:
O14842
Residue:
300
  
Inhibitor
Name:
BDBM50344082
Synonyms:
CHEMBL1777875 | trans-rac-2-(4-(2-chloro-4-(trifluoromethyl)phenoxy)phenyl)-2-(prop-1-ynyl)cyclopropanecarboxylic acid
Type:
Small organic molecule
Emp. Form.:
C20H14ClF3O3
Mol. Mass.:
394.772
SMILES:
CC#C[C@@]1(C[C@H]1C(O)=O)c1ccc(Oc2ccc(cc2Cl)C(F)(F)F)cc1
: