Target
Cytochrome P450 2C9
Ligand
BDBM50344086
Substrate
Meas. Tech.
ChEMBL_748602 (CHEMBL1780455)
IC50
2400±n/a nM
Citation
 Walsh, SPSeverino, AZhou, CHe, JLiang, GBTan, CPCao, JEiermann, GJXu, LSalituro, GHoward, ADMills, SGYang, L 3-Substituted 3-(4-aryloxyaryl)-propanoic acids as GPR40 agonists. Bioorg Med Chem Lett 21:3390-4 (2011)  
Target
Name:
Cytochrome P450 2C9
Synonyms:
(R)-limonene 6-monooxygenase CP2C9_HUMAN CYP2C9 Cytochrome P450 2C9 (CYP2C9 ) P-450MP P450 PB-1 | S-mephenytoin 4-hydroxylase
Type:
Enzyme
Mol. Mass.:
55636.33
Organism:
Homo sapiens (Human)
Description:
P11712
Residue:
490
  
Inhibitor
Name:
BDBM50344086
Synonyms:
CHEMBL1777878 | cis-rac-5-(1-(4-(2-(difluoromethoxy)-4-(trifluoromethyl)phenoxy)phenyl)but-2-ynyl)oxazolidine-2,4-dione
Type:
Small organic molecule
Emp. Form.:
C21H14F5NO5
Mol. Mass.:
455.3316
SMILES:
CC#C[C@H](c1oc(=O)[nH]c1O)c1ccc(Oc2ccc(cc2OC(F)F)C(F)(F)F)cc1
: