Target
Potassium voltage-gated channel subfamily H member 2
Ligand
BDBM50344080
Substrate
Meas. Tech.
ChEMBL_748605 (CHEMBL1780458)
IC50
25000±n/a nM
Citation
 Walsh, SPSeverino, AZhou, CHe, JLiang, GBTan, CPCao, JEiermann, GJXu, LSalituro, GHoward, ADMills, SGYang, L 3-Substituted 3-(4-aryloxyaryl)-propanoic acids as GPR40 agonists. Bioorg Med Chem Lett 21:3390-4 (2011)  
Target
Name:
Potassium voltage-gated channel subfamily H member 2
Synonyms:
1,3-beta-glucan synthase component GLS2 ERG Eag-related protein 1 Ether-a-go-go-related gene (HERG) Ether-a-go-go-related gene potassium channel 1 Ether-a-go-go-related gene potassium channel 1 (hERG1) Ether-a-go-go-related protein 1 H-ERG KCNH2 Potassium voltage-gated channel subfamily H member 2 (hERG) Voltage-gated potassium channel subunit Kv11.1 hERG Potassium Channel 1 | putative potassium channel subunit
Type:
Multi-pass membrane protein
Mol. Mass.:
126672.65
Organism:
Homo sapiens (Human)
Description:
Q12809
Residue:
1159
  
Inhibitor
Name:
BDBM50344080
Synonyms:
CHEMBL1777855 | rac-3-(4-(2-(difluoromethoxy)-4-(trifluoromethyl)phenoxy)-2-fluorophenyl)hex-4-ynoic acid
Type:
Small organic molecule
Emp. Form.:
C20H14F6O4
Mol. Mass.:
432.3132
SMILES:
CC#CC(CC(O)=O)c1ccc(Oc2ccc(cc2OC(F)F)C(F)(F)F)cc1F
: