Target
Cytochrome P450 3A4
Ligand
BDBM50344086
Substrate
Meas. Tech.
ChEMBL_748604 (CHEMBL1780457)
IC50
>50000±n/a nM
Citation
 Walsh, SPSeverino, AZhou, CHe, JLiang, GBTan, CPCao, JEiermann, GJXu, LSalituro, GHoward, ADMills, SGYang, L 3-Substituted 3-(4-aryloxyaryl)-propanoic acids as GPR40 agonists. Bioorg Med Chem Lett 21:3390-4 (2011)  
Target
Name:
Cytochrome P450 3A4
Synonyms:
Albendazole monooxygenase CP3A4_HUMAN CYP3A4 CYPIIIA4 Cytochrome P450 3A4 (CYP3A4) Nifedipine oxidase Taurochenodeoxycholate 6-alpha-hydroxylase
Type:
Enzyme
Mol. Mass.:
57349.57
Organism:
Homo sapiens (Human)
Description:
Residue:
503
  
Inhibitor
Name:
BDBM50344086
Synonyms:
CHEMBL1777878 | cis-rac-5-(1-(4-(2-(difluoromethoxy)-4-(trifluoromethyl)phenoxy)phenyl)but-2-ynyl)oxazolidine-2,4-dione
Type:
Small organic molecule
Emp. Form.:
C21H14F5NO5
Mol. Mass.:
455.3316
SMILES:
CC#C[C@H](c1oc(=O)[nH]c1O)c1ccc(Oc2ccc(cc2OC(F)F)C(F)(F)F)cc1
: