Target
Muscarinic acetylcholine receptor M2
Ligand
BDBM50344284
Substrate
Meas. Tech.
ChEMBL_748301 (CHEMBL1781311)
IC50
573.7±n/a nM
Citation
 Prat, MBuil, MAFernández, MDCastro, JMonleón, JMTort, LCasals, GFerrer, MHuerta, JMEspinosa, SLópez, MSegarra, VGavaldà, AMiralpeix, MRamos, IVilella, DGonzález, MCórdoba, MCárdenas, AAntón, FBeleta, JRyder, H Discovery of novel quaternary ammonium derivatives of (3R)-quinuclidinyl carbamates as potent and long acting muscarinic antagonists. Bioorg Med Chem Lett 21:3457-61 (2011)  
Target
Name:
Muscarinic acetylcholine receptor M2
Synonyms:
ACM2_HUMAN Cholinergic, muscarinic M2 Muscarinic acetylcholine receptor M2 and M5 | RecName: Full=Muscarinic acetylcholine receptor M2
Type:
GPCR
Mol. Mass.:
51730.61
Organism:
Homo sapiens (Human)
Description:
P08172
Residue:
466
  
Inhibitor
Name:
BDBM50344284
Synonyms:
CHEMBL1200803 Solifenacin succinate YM-905 | vesicare
Type:
Small organic molecule
Emp. Form.:
C23H26N2O2
Mol. Mass.:
362.4647
SMILES:
O=C(O[C@H]1CN2CCC1CC2)N1CCc2ccccc2[C@@H]1c1ccccc1
: