Target
Serine/threonine-protein kinase B-raf
Ligand
BDBM50344452
Substrate
Meas. Tech.
ChEMBL_747719 (CHEMBL1780874)
IC50
>1000±n/a nM
Citation
 Newhouse, BJHansen, JDGrina, JWelch, MTopalov, GLittman, NCallejo, MMartinson, MGalbraith, SLaird, ERBrandhuber, BJVigers, GMorales, TWoessner, RRandolph, NLyssikatos, JOlivero, A Non-oxime pyrazole based inhibitors of B-Raf kinase. Bioorg Med Chem Lett 21:3488-92 (2011)  
Target
Name:
Serine/threonine-protein kinase B-raf
Synonyms:
B-RAF B-Raf proto-oncogene serine/threonine-protein kinase BRAF1 RAFB1 v-Raf murine sarcoma viral oncogene homolog B1
Type:
Serine/threonine-protein kinase
Mol. Mass.:
84446.00
Organism:
Homo sapiens (Human)
Description:
P15056
Residue:
766
  
Inhibitor
Name:
BDBM50344452
Synonyms:
4-(4-(4-(4-ethyl-1H-pyrazol-3-yl)phenyl)-1-methyl-1H-pyrazol-3-yl)pyridine | CHEMBL1780148
Type:
Small organic molecule
Emp. Form.:
C20H19N5
Mol. Mass.:
329.3984
SMILES:
CCc1c[nH]nc1-c1ccc(cc1)-c1cn(C)nc1-c1ccncc1
: