Target
Serine/threonine-protein kinase B-raf
Ligand
BDBM50344454
Substrate
Meas. Tech.
ChEMBL_747719 (CHEMBL1780874)
IC50
>1000±n/a nM
Citation
 Newhouse, BJHansen, JDGrina, JWelch, MTopalov, GLittman, NCallejo, MMartinson, MGalbraith, SLaird, ERBrandhuber, BJVigers, GMorales, TWoessner, RRandolph, NLyssikatos, JOlivero, A Non-oxime pyrazole based inhibitors of B-Raf kinase. Bioorg Med Chem Lett 21:3488-92 (2011)  
Target
Name:
Serine/threonine-protein kinase B-raf
Synonyms:
B-RAF B-Raf proto-oncogene serine/threonine-protein kinase BRAF1 RAFB1 v-Raf murine sarcoma viral oncogene homolog B1
Type:
Serine/threonine-protein kinase
Mol. Mass.:
84446.00
Organism:
Homo sapiens (Human)
Description:
P15056
Residue:
766
  
Inhibitor
Name:
BDBM50344454
Synonyms:
7-(1-methyl-3-(pyridin-4-yl)-1H-pyrazol-4-yl)-4,5-dihydro-2H-benzo[e]indazole | CHEMBL1780150
Type:
Small organic molecule
Emp. Form.:
C20H17N5
Mol. Mass.:
327.3825
SMILES:
Cn1cc(c(n1)-c1ccncc1)-c1ccc2-c3cn[nH]c3CCc2c1
: