Target
Serine/threonine-protein kinase B-raf
Ligand
BDBM50344455
Substrate
Meas. Tech.
ChEMBL_747719 (CHEMBL1780874)
IC50
11±n/a nM
Citation
 Newhouse, BJHansen, JDGrina, JWelch, MTopalov, GLittman, NCallejo, MMartinson, MGalbraith, SLaird, ERBrandhuber, BJVigers, GMorales, TWoessner, RRandolph, NLyssikatos, JOlivero, A Non-oxime pyrazole based inhibitors of B-Raf kinase. Bioorg Med Chem Lett 21:3488-92 (2011)  
Target
Name:
Serine/threonine-protein kinase B-raf
Synonyms:
B-RAF B-Raf proto-oncogene serine/threonine-protein kinase BRAF1 RAFB1 v-Raf murine sarcoma viral oncogene homolog B1
Type:
Serine/threonine-protein kinase
Mol. Mass.:
84446.00
Organism:
Homo sapiens (Human)
Description:
P15056
Residue:
766
  
Inhibitor
Name:
BDBM50344455
Synonyms:
6-(1-methyl-3-(pyridin-4-yl)-1H-pyrazol-4-yl)-2,8-dihydroindeno[2,1-d][1,2,3]triazole | CHEMBL1780151
Type:
Small organic molecule
Emp. Form.:
C18H14N6
Mol. Mass.:
314.344
SMILES:
Cn1cc(c(n1)-c1ccncc1)-c1ccc2c(cc3[nH][nH]nc23)c1
: