Target
Serine/threonine-protein kinase B-raf
Ligand
BDBM50344458
Substrate
Meas. Tech.
ChEMBL_747719 (CHEMBL1780874)
IC50
647±n/a nM
Citation
 Newhouse, BJHansen, JDGrina, JWelch, MTopalov, GLittman, NCallejo, MMartinson, MGalbraith, SLaird, ERBrandhuber, BJVigers, GMorales, TWoessner, RRandolph, NLyssikatos, JOlivero, A Non-oxime pyrazole based inhibitors of B-Raf kinase. Bioorg Med Chem Lett 21:3488-92 (2011)  
Target
Name:
Serine/threonine-protein kinase B-raf
Synonyms:
B-RAF B-Raf proto-oncogene serine/threonine-protein kinase BRAF1 RAFB1 v-Raf murine sarcoma viral oncogene homolog B1
Type:
Serine/threonine-protein kinase
Mol. Mass.:
84446.00
Organism:
Homo sapiens (Human)
Description:
P15056
Residue:
766
  
Inhibitor
Name:
BDBM50344458
Synonyms:
CHEMBL1780155 | N-methyl-4-(1-methyl-3-(pyridin-4-yl)-1H-pyrazol-4-yl)benzamide
Type:
Small organic molecule
Emp. Form.:
C17H16N4O
Mol. Mass.:
292.3351
SMILES:
CNC(=O)c1ccc(cc1)-c1cn(C)nc1-c1ccncc1
: