Target
Serine/threonine-protein kinase B-raf
Ligand
BDBM50344462
Substrate
Meas. Tech.
ChEMBL_747719 (CHEMBL1780874)
IC50
861±n/a nM
Citation
 Newhouse, BJHansen, JDGrina, JWelch, MTopalov, GLittman, NCallejo, MMartinson, MGalbraith, SLaird, ERBrandhuber, BJVigers, GMorales, TWoessner, RRandolph, NLyssikatos, JOlivero, A Non-oxime pyrazole based inhibitors of B-Raf kinase. Bioorg Med Chem Lett 21:3488-92 (2011)  
Target
Name:
Serine/threonine-protein kinase B-raf
Synonyms:
B-RAF B-Raf proto-oncogene serine/threonine-protein kinase BRAF1 RAFB1 v-Raf murine sarcoma viral oncogene homolog B1
Type:
Serine/threonine-protein kinase
Mol. Mass.:
84446.00
Organism:
Homo sapiens (Human)
Description:
P15056
Residue:
766
  
Inhibitor
Name:
BDBM50344462
Synonyms:
5-(1-methyl-3-(pyridin-4-yl)-1H-pyrazol-4-yl)-1H-indole | CHEMBL1780159
Type:
Small organic molecule
Emp. Form.:
C17H14N4
Mol. Mass.:
274.3199
SMILES:
Cn1cc(c(n1)-c1ccncc1)-c1ccc2[nH]ccc2c1
: