Target
Serine/threonine-protein kinase B-raf
Ligand
BDBM50344472
Substrate
Meas. Tech.
ChEMBL_747719 (CHEMBL1780874)
IC50
3.2±n/a nM
Citation
 Newhouse, BJHansen, JDGrina, JWelch, MTopalov, GLittman, NCallejo, MMartinson, MGalbraith, SLaird, ERBrandhuber, BJVigers, GMorales, TWoessner, RRandolph, NLyssikatos, JOlivero, A Non-oxime pyrazole based inhibitors of B-Raf kinase. Bioorg Med Chem Lett 21:3488-92 (2011)  
Target
Name:
Serine/threonine-protein kinase B-raf
Synonyms:
B-RAF B-Raf proto-oncogene serine/threonine-protein kinase BRAF1 RAFB1 v-Raf murine sarcoma viral oncogene homolog B1
Type:
Serine/threonine-protein kinase
Mol. Mass.:
84446.00
Organism:
Homo sapiens (Human)
Description:
P15056
Residue:
766
  
Inhibitor
Name:
BDBM50344472
Synonyms:
6-(1-(azepan-4-yl)-3-(pyridin-4-yl)-1H-pyrazol-4-yl)-2,4-dihydroindeno[1,2-c]pyrazole | CHEMBL1780169
Type:
Small organic molecule
Emp. Form.:
C24H24N6
Mol. Mass.:
396.4876
SMILES:
C1c2c[nH]nc2-c2ccc(cc12)-c1cn(nc1-c1ccncc1)C1CCCNCC1
: