Target
Serine/threonine-protein kinase B-raf
Ligand
BDBM50344479
Substrate
Meas. Tech.
ChEMBL_747719 (CHEMBL1780874)
IC50
5±n/a nM
Citation
 Newhouse, BJHansen, JDGrina, JWelch, MTopalov, GLittman, NCallejo, MMartinson, MGalbraith, SLaird, ERBrandhuber, BJVigers, GMorales, TWoessner, RRandolph, NLyssikatos, JOlivero, A Non-oxime pyrazole based inhibitors of B-Raf kinase. Bioorg Med Chem Lett 21:3488-92 (2011)  
Target
Name:
Serine/threonine-protein kinase B-raf
Synonyms:
B-RAF B-Raf proto-oncogene serine/threonine-protein kinase BRAF1 RAFB1 v-Raf murine sarcoma viral oncogene homolog B1
Type:
Serine/threonine-protein kinase
Mol. Mass.:
84446.00
Organism:
Homo sapiens (Human)
Description:
P15056
Residue:
766
  
Inhibitor
Name:
BDBM50344479
Synonyms:
7-(4-(2,4-dihydroindeno[1,2-c]pyrazol-6-yl)-3-(pyridin-4-yl)-1H-pyrazol-1-yl)-3-oxa-9-azabicyclo[3.3.1]nonane | CHEMBL1780176
Type:
Small organic molecule
Emp. Form.:
C25H24N6O
Mol. Mass.:
424.4977
SMILES:
C1c2c[nH]nc2-c2ccc(cc12)-c1cn(nc1-c1ccncc1)C1CC2COCC(C1)N2
: