Target
Serine/threonine-protein kinase B-raf
Ligand
BDBM50344480
Substrate
Meas. Tech.
ChEMBL_747719 (CHEMBL1780874)
IC50
1.4±n/a nM
Citation
 Newhouse, BJHansen, JDGrina, JWelch, MTopalov, GLittman, NCallejo, MMartinson, MGalbraith, SLaird, ERBrandhuber, BJVigers, GMorales, TWoessner, RRandolph, NLyssikatos, JOlivero, A Non-oxime pyrazole based inhibitors of B-Raf kinase. Bioorg Med Chem Lett 21:3488-92 (2011)  
Target
Name:
Serine/threonine-protein kinase B-raf
Synonyms:
B-RAF B-Raf proto-oncogene serine/threonine-protein kinase BRAF1 RAFB1 v-Raf murine sarcoma viral oncogene homolog B1
Type:
Serine/threonine-protein kinase
Mol. Mass.:
84446.00
Organism:
Homo sapiens (Human)
Description:
P15056
Residue:
766
  
Inhibitor
Name:
BDBM50344480
Synonyms:
6-(1-((3R,4R)-3-fluoropiperidin-4-yl)-3-(pyridin-4-yl)-1H-pyrazol-4-yl)-2,4-dihydroindeno[1,2-c]pyrazole | CHEMBL1780177
Type:
Small organic molecule
Emp. Form.:
C23H21FN6
Mol. Mass.:
400.4514
SMILES:
F[C@@H]1CNCC[C@H]1n1cc(c(n1)-c1ccncc1)-c1ccc-2c(Cc3c[nH]nc-23)c1
: