Target
Serine/threonine-protein kinase B-raf
Ligand
BDBM50344470
Substrate
Meas. Tech.
ChEMBL_747761 (CHEMBL1780960)
IC50
262±n/a nM
Citation
 Newhouse, BJHansen, JDGrina, JWelch, MTopalov, GLittman, NCallejo, MMartinson, MGalbraith, SLaird, ERBrandhuber, BJVigers, GMorales, TWoessner, RRandolph, NLyssikatos, JOlivero, A Non-oxime pyrazole based inhibitors of B-Raf kinase. Bioorg Med Chem Lett 21:3488-92 (2011)  
Target
Name:
Serine/threonine-protein kinase B-raf
Synonyms:
B-RAF B-Raf proto-oncogene serine/threonine-protein kinase BRAF1 RAFB1 v-Raf murine sarcoma viral oncogene homolog B1
Type:
Serine/threonine-protein kinase
Mol. Mass.:
84446.00
Organism:
Homo sapiens (Human)
Description:
P15056
Residue:
766
  
Inhibitor
Name:
BDBM50344470
Synonyms:
6-(1-(8-azabicyclo[3.2.1]octan-3-yl)-3-(pyridin-4-yl)-1H-pyrazol-4-yl)-2,4-dihydroindeno[1,2-c]pyrazole | CHEMBL1780167
Type:
Small organic molecule
Emp. Form.:
C25H24N6
Mol. Mass.:
408.4983
SMILES:
C1CC2CC(CC1N2)n1cc(c(n1)-c1ccncc1)-c1ccc-2c(Cc3c[nH]nc-23)c1
: