Target
Serine/threonine-protein kinase B-raf
Ligand
BDBM50344476
Substrate
Meas. Tech.
ChEMBL_747761 (CHEMBL1780960)
IC50
607±n/a nM
Citation
 Newhouse, BJHansen, JDGrina, JWelch, MTopalov, GLittman, NCallejo, MMartinson, MGalbraith, SLaird, ERBrandhuber, BJVigers, GMorales, TWoessner, RRandolph, NLyssikatos, JOlivero, A Non-oxime pyrazole based inhibitors of B-Raf kinase. Bioorg Med Chem Lett 21:3488-92 (2011)  
Target
Name:
Serine/threonine-protein kinase B-raf
Synonyms:
B-RAF B-Raf proto-oncogene serine/threonine-protein kinase BRAF1 RAFB1 v-Raf murine sarcoma viral oncogene homolog B1
Type:
Serine/threonine-protein kinase
Mol. Mass.:
84446.00
Organism:
Homo sapiens (Human)
Description:
P15056
Residue:
766
  
Inhibitor
Name:
BDBM50344476
Synonyms:
CHEMBL1780173 | cis-(1R,3S)-3-(4-(2,4-dihydroindeno[1,2-c]pyrazol-6-yl)-3-(pyridin-4-yl)-1H-pyrazol-1-yl)cyclohexanol
Type:
Small organic molecule
Emp. Form.:
C24H23N5O
Mol. Mass.:
397.4723
SMILES:
O[C@@H]1CCC[C@@H](C1)n1cc(c(n1)-c1ccncc1)-c1ccc-2c(Cc3c[nH]nc-23)c1
: